program quality indicators
type: Concept
definition: Bilingual education researchers have identified several program quality indicators. Seven of the most commonly cited indicators that are foundational to all good programs are summarized below. [Source: Encyclopedia of Bilingual Education; Program Quality Indicators]
broader: instructional design

instructional design
type: Concept
narrower: program quality indicators

concepts
type: Collection
type: ConceptGroup
member: program quality indicators