theory and methodology
type: Concept
narrower: psychological behaviorism

psychological behaviorism
type: Concept
definition: Introduction Behaviourism, with its goal of establishing the general theory of conditioning, has never had much of a connection to the traditional field of psychological measurement. Psychological measurement has a contrasting goal, that of dealing with individual differences. [Source: Encyclopedia of Psychological Assessment; Theoretical Perspective: Psychological Behaviourism]
broader: theory and methodology

concepts
type: Collection
type: ConceptGroup
member: psychological behaviorism