psychometric G
type: Concept
definition: Psychometric g is the general factor that underlies individual differences on cognitive ability tests. All cognitive tests measure g to some extent, but intelligence quotient (IQ) tests tend to measure it particularly well. [Source: Encyclopedia of School Psychology; Psychometric G]
broader: assessment

assessment
type: Concept
narrower: psychometric G

concepts
type: Collection
type: ConceptGroup
member: psychometric G