public information
type: Concept
definition: Public information, in general terms, refers to that information that is universally available or that is not controlled or limited in its availability for strategic or security purposes. Public information includes records held by a public body, regardless of the form or source. [Source: Encyclopedia of Governance; Public Information]
broader: information governance

information governance
type: Concept
narrower: public information

concepts
type: Collection
type: ConceptGroup
member: public information