pyromania
type: Concept
definition: the pathological desire or compulsion to set things on fire. [Source: The Concise Dictionary of Crime and Justice; Pyromania]
broader: impulse disorders

impulse disorders
type: Concept
narrower: pyromania

concepts
type: Collection
type: ConceptGroup
member: pyromania