qualitative approaches
type: Concept
definition: Qualitative approaches to organization studies employ research methods that emphasize detailed, personal descriptions of phenomena. In short, they use the meaning that organizational members attribute to phenomena occurring in organizations to understand these phenomena. [Source: International Encyclopedia of Organization Studies; Qualitative Approaches]
broader: research practice and methodology

research practice and methodology
type: Concept
narrower: qualitative approaches

methods
type: Collection
type: ConceptGroup
member: qualitative approaches