quality improvement cycle
type: Concept
definition: The term quality improvement cycle has been used throughout the literature in a variety of ways. It is sometimes used in a general sense, for example, to represent a never-ending cycle of experimentation and continuous improvement. [Source: Encyclopedia of Health Care Management; Quality Improvement Cycle]
broader: quality management

quality management
type: Concept
narrower: quality improvement cycle

concepts
type: Collection
type: ConceptGroup
member: quality improvement cycle