race-based crimes
type: Concept
definition: Race-based crimes occur when an offender targets a victim because of his/her racial group. Perpetrators of such crimes are motivated by bias against particular racial groups. [Source: The Social History of Crime and Punishment in America: An Encylopedia; Race-Based Crimes]
broader: crimes in America

crimes in America
type: Concept
narrower: race-based crimes

concepts
type: Collection
type: ConceptGroup
member: race-based crimes