human development and life transitions
type: Concept
narrower: racial identity

concepts
type: Collection
type: ConceptGroup
member: racial identity

racial identity
type: Concept
definition: Racial identities have an important, although shifting, relevance in the global era. It is important, however, for scholars of global studies to keep in mind that racial identities vary greatly across cultures, nations, and time. [Source: Encyclopedia of Global Studies; Racial Identity]
broader: human development and life transitions