racing demon
type: Concept
definition: Racing Demon, also known as Gluck, Grouch, Lucky Thirty, Nerds, Nerts, Nertz, Mertz, Moofles, Peanuts, Popeye, Pounce, Solitaire Frenzy, Stop, Squeal, Squeak, Squid, Speed, Squinch, or Race Horse Rummy, is a Solitaire variant played with a standard 52-card deck. It incorporates elements of Spit, is usually played by multiple players simultaneously (each with their own deck), and is known for its rapid pace. [Source: Encyclopedia of Play in Today's Society; Racing Demon]
broader: card games

card games
type: Concept
narrower: racing demon

concepts
type: Collection
type: ConceptGroup
member: racing demon