radical geography
type: Concept
definition: Radical geography began as an explicitly termed area of study in Anglophone geography during the late 1960s amid a context of crisis. Cold war militarism and imperialism had a heavy human cost in Vietnam, extreme race and class stratification of American cities had been accompanied by massive unrest, and the global economy was limping along under inflation, stagnant productivity gains, and a looming international debt crisis. [Source: Encyclopedia of Human Geography; Radical Geography]
broader: human geography theory

human geography theory
type: Concept
narrower: radical geography

concepts
type: Collection
type: ConceptGroup
member: radical geography