reform judaism
type: Concept
definition: Reform Judaism originated in Germany in the 19th century. Jewish reformers were motivated by three great realities: a desire to take full advantage of newly granted rights, the Emancipation in Europe, and the Enlightenment. [Source: Encyclopedia of Religious and Spiritual Development; Judaism, Reform]
broader: religious traditions and groups

religious traditions and groups
type: Concept
narrower: reform judaism

concepts
type: Collection
type: ConceptGroup
member: reform judaism