school types
type: Concept
narrower: reform schools

reform schools
type: Concept
definition: In the 19th century, social reformers in America noted that there were negative connotations associated with the practice of treating juvenile offenders the same as adult criminals. Managing young offenders became a tremendous concern for the criminal justice system. [Source: Encyclopedia of Educational Reform and Dissent; Reform Schools]
broader: school types

concepts
type: Collection
type: ConceptGroup
member: reform schools