regional authority
type: Concept
definition: A regional authority is an administrative body responsible for governing a geographically defined region. Its responsibilities may be general or limited to a given sector of activity, and its autonomy may range from almost autonomous to directly controlled by an upper level of government. [Source: Encyclopedia of Governance; Regional Authority]
broader: local governance

local governance
type: Concept
narrower: regional authority

concepts
type: Collection
type: ConceptGroup
member: regional authority