religiosity
type: Concept
definition: Religiosity refers to the strength and scope of religious activity among faith-based communities. Although “religion” and “religiosity” are often used synonymously, there is a considerable difference between these two terms. [Source: International Encyclopedia of Political Science; Religiosity]
broader: religion

religion
type: Concept
narrower: religiosity

concepts
type: Collection
type: ConceptGroup
member: religiosity