methodology
type: Concept
narrower: research methods and issues

research methods and issues
type: Concept
definition: Group processes can be conceptualized as the mechanisms or intervening factors that connect properties of groups (e.g., group size, average skill level, diversity, or identity) to outcomes. Examples include the actions or communication that groups engage in while making decisions, negotiating, or coordinating their activities. [Source: Encyclopedia of Group Processes & Intergroup Relations; Research Methods and Issues]
broader: methodology

concepts
type: Collection
type: ConceptGroup
member: research methods and issues