resource dependency theory
type: Concept
definition: Resource dependency theory (RDT) is a strategic management theory used to explain organizational behavior and effectiveness. RDT is concerned with how the need for resources affects an organization's actions within its environment. [Source: Encyclopedia of Public Relations; Resource Dependency Theory]
broader: organization theory

organization theory
type: Concept
narrower: resource dependency theory

concepts
type: Collection
type: ConceptGroup
member: resource dependency theory