response rate
type: Concept
definition: A study's response rate is an important gauge for the quality of data collection. The response rate, in its most basic form, refers to the proportion of people eligible for a study who actually enroll and participate. [Source: Encyclopedia of Epidemiology; Response Rate]
broader: statistics and research methods

statistics and research methods
type: Concept
narrower: response rate

methods
type: Collection
type: ConceptGroup
member: response rate