resurrection
type: Concept
definition: Resurrection means rising from the dead. The word comes from Middle English, Anglo-French, and Latin (from resurrectio “the act of rising from the dead,” from resurgere “to rise from the dead,” from Latin re- “again” + surgere “to rise”). [Source: Encyclopedia of Death and the Human Experience; Resurrection]
broader: religion

religion
type: Concept
narrower: resurrection

concepts
type: Collection
type: ConceptGroup
member: resurrection