behavioral therapy
type: Concept
narrower: retention control training

concepts
type: Collection
type: ConceptGroup
member: retention control training

retention control training
type: Concept
definition: Retention control training (RCT) is a daytime treatment procedure for nocturnal enuresis (i.e., bed-wetting) designed to increase functional bladder capacity (e.g., how much urine an individual can retain before voiding).
broader: behavioral therapy