legislative studies
type: Concept
narrower: rules of order

rules of order
type: Concept
definition: Rules of order are standardized procedural rules adopted by any deliberative body or assembly. Constitutions, bylaws, and rules of order are the general documents used to govern and define deliberative bodies. [Source: The Encyclopedia of Political Science; Rules of Order]
broader: legislative studies

concepts
type: Collection
type: ConceptGroup
member: rules of order