representation and electoral systems
type: Concept
narrower: run-off

run-off
type: Concept
definition: Run-off electoral systems use two rounds of voting to select a single winner. The first round eliminates some of the candidates, while the second round chooses between the remaining candidates. [Source: The Encyclopedia of Political Science; Run-off]
broader: representation and electoral systems

concepts
type: Collection
type: ConceptGroup
member: run-off