food and nutrition
type: Concept
narrower: salt

concepts
type: Collection
type: ConceptGroup
member: salt

salt
type: Concept
definition: Salt is a compound of sodium and chlorine (NaCl) that is an essential ingredient for human life. The human body has to maintain a saline solution in the blood in order to be healthy. [Source: Encyclopedia of Environment and Society; Salt]
broader: food and nutrition