saturation policing
type: Concept
definition: Zero-tolerance policing is most commonly referred to as a policing strategy in which police resources are used to aggressively enforce criminal (and in some situations civil) laws. Zero-tolerance policing goes by a variety of different labels including, but not limited to, quality-of-life policing, incivilities policing, broken-windows policing, and order-maintenance policing. [Source: Encyclopedia of Street Crime in America; Zero-Tolerance/Saturation Policing]
broader: policing

policing
type: Concept
narrower: saturation policing

concepts
type: Collection
type: ConceptGroup
member: saturation policing