second-order factors
type: Concept
definition: factors obtained in factor analysis from factor analysing the results of an oblique factor rotation which allows the factors to correlate. The correlation matrix of the factors can then be factor analysed to give new factors which are factors of factors. [Source: The SAGE Dictionary of Statistics; second-order factors]
broader: factor analysis

factor analysis
type: Concept
narrower: second-order factors

methods
type: Collection
type: ConceptGroup
member: second-order factors