semantics and pragmatics
type: Concept
definition: Semantics and pragmatics are the two major branches of linguistics devoted to the study of meaning in language. This much is largely accepted. [Source: Encyclopedia of Philosophy and the Social Sciences; Semantics and Pragmatics]
broader: general philosophy

general philosophy
type: Concept
narrower: semantics and pragmatics

concepts
type: Collection
type: ConceptGroup
member: semantics and pragmatics