offenders
type: Concept
narrower: serial killers

concepts
type: Collection
type: ConceptGroup
member: serial killers

serial killers
type: Concept
definition: People are fascinated by violent crime, and serial murder may be the most fascinating crime of all. Books, newspapers, television shows, and movies recount the destructive paths of those who kill repeatedly. [Source: Encyclopedia of Psychology and Law; Serial Killers]
broader: offenders