set theory
type: Concept
definition: A branch of logic and mathematics that deals with the characteristics of and relations among ∗sets. [Source: Dictionary of Statistics & Methodology; Set Theory]
broader: mathematics

mathematics
type: Concept
narrower: set theory

concepts
type: Collection
type: ConceptGroup
member: set theory