seven up
type: Concept
definition: Whether it's called Heads Up, Seven Up, Thumbs Up, or any combination of the three, Seven Up has long been an easy game to start and complete in classrooms, camps, and other child's play areas around the world. It requires little or no equipment or time, only a few players and a bit of guessing ability. [Source: Encyclopedia of Play in Today's Society; Seven Up]
broader: card games

card games
type: Concept
narrower: seven up

concepts
type: Collection
type: ConceptGroup
member: seven up