sex differences
type: Concept
definition: Sex differences in incidence rates occur in a number of major psychological disorders, particularly depression, eating disorders, several anxiety disorders, antisocial personality disorder (formerly called sociopathy or psychopathy), conduct disorder (a childhood disorder similar to antisocial personality disorder), and attention deficit hyperactivity disorder. Additionally, the specific symptom patterns and courses of some psychological disorders differ for women and men, or girls and boys. [Source: Cultural Sociology of Mental Illness: An A-to-Z Guide; Sex Differences]
broader: social development and social behavior

social development and social behavior
type: Concept
narrower: sex differences

concepts
type: Collection
type: ConceptGroup
member: sex differences