finance ethics
type: Concept
narrower: shareholder resolutions

concepts
type: Collection
type: ConceptGroup
member: shareholder resolutions

shareholder resolutions
type: Concept
definition: A shareholder resolution is a request that shareholders vote on a recommendation that the corporation and/or the board undertake certain action. It appears in a company's proxy statement to be presented at a company's annual meeting. [Source: Encyclopedia of Business Ethics and Society; Shareholder Resolutions]
broader: finance ethics