silviculture
type: Concept
definition: The cultivation of trees in forests, including the management of natural forests, plantation management and forestry practices. It is essentially applied forest ecology. [Source: Encyclopedia of Environmental Change; silviculture]
broader: forestry

forestry
type: Concept
narrower: silviculture

concepts
type: Collection
type: ConceptGroup
member: silviculture