social informatics
type: Concept
definition: As with ecoinformatics or geoinformatics, social informatics lies at the intersection between information technology and a substantive scientific domain, in this case, social science. It has two distinct meanings. [Source: Encyclopedia of Human Geography; Social Informatics]
broader: geographic information systems

geographic information systems
type: Concept
narrower: social informatics

concepts
type: Collection
type: ConceptGroup
member: social informatics