social value orientation
type: Concept
definition: People differ in how they approach others. Some people tend to approach others in a cooperative manner, whereas other people tend to approach others in a more self-centered manner. [Source: Encyclopedia of Social Psychology; Social Value Orientation]
broader: interpersonal relationships

interpersonal relationships
type: Concept
narrower: social value orientation

concepts
type: Collection
type: ConceptGroup
member: social value orientation