social science of networking
type: Concept
narrower: sororities

sororities
type: Concept
definition: Sororities were founded across the nation to form networks for women to create and maintain connections during and after college. These organizations provide college women with transitional support from high school to college and from college to the workplace and/or marriage. [Source: Encyclopedia of Social Networks; Sororities]
broader: social science of networking

concepts
type: Collection
type: ConceptGroup
member: sororities