spatial organization
type: Concept
definition: Spatial organization is one of the most important yet underdeveloped areas for both management practice and organization theory. Spatial organization can be understood as the physical and material constitution of a social system. [Source: International Encyclopedia of Organization Studies; Spatial Organization]
broader: issues in organizational structure

issues in organizational structure
type: Concept
narrower: spatial organization

concepts
type: Collection
type: ConceptGroup
member: spatial organization