spatial reasoning
type: Concept
definition: The field of spatial reasoning investigates representations and inference mechanisms that enable one to draw conclusions from spatial information. It is also concerned with computational implementation of spatial reasoning algorithms and their exploitation in applications such as robot control, image processing, and manipulation of geographic information. [Source: Encyclopedia of Geographic Information Science; Spatial Reasoning]
broader: conceptual foundations of GIS

conceptual foundations of GIS
type: Concept
narrower: spatial reasoning

concepts
type: Collection
type: ConceptGroup
member: spatial reasoning