special needs population
type: Concept
definition: When discussing distributed learning, the special needs population consists of persons with disabilities who need special hardware and/or software to permit them to use standard computers easily and efficiently. Actually, some people that are usually included in the special needs population have no problems with computers. [Source: Encyclopedia of Distributed Learning; Special Needs Population]
broader: educational groups

educational groups
type: Concept
narrower: special needs population

concepts
type: Collection
type: ConceptGroup
member: special needs population