diversion and probation
type: Concept
narrower: specialized caseload models

specialized caseload models
type: Concept
definition: Community corrections offer alternatives to incarceration and long-term imprisonment. A specialized caseload approach provides the means for addressing an offender's individual needs for rehabilitation, and correctional efforts have recently focused on improved specialized caseload models. [Source: Encyclopedia of Community Corrections; Specialized Caseload Models]
broader: diversion and probation

concepts
type: Collection
type: ConceptGroup
member: specialized caseload models