foreign policy
type: Concept
narrower: statecraft

statecraft
type: Concept
definition: Simply put, statecraft is the art of conducting state affairs, which may be either domestic or foreign. Statecraft is generally defined in two ways. [Source: The Encyclopedia of Political Science; Statecraft]
broader: foreign policy

concepts
type: Collection
type: ConceptGroup
member: statecraft