status relations
type: Concept
definition: Status generally refers to an individual's position or rank, along a standard of honor or respect, within a group or social hierarchy. As such, status relations are defined as observable rank-ordered pairings of individuals in some social situation. [Source: Encyclopedia of Social Theory; Status Relations]
broader: microbehaviorist theory

microbehaviorist theory
type: Concept
narrower: status relations

concepts
type: Collection
type: ConceptGroup
member: status relations