development patterns
type: Concept
narrower: subdivision controls

concepts
type: Collection
type: ConceptGroup
member: subdivision controls

subdivision controls
type: Concept
definition: Subdivision is a necessary step in the process of residential development. Land is subdivided when its owner divides a tract of land into two or more smaller parts for the purpose of conveying the parts to separate owners. [Source: The Encyclopedia of Housing; Subdivision Controls]
broader: development patterns