subliminal advertising
type: Concept
definition: The word subliminal comes from two Latin words, “sub,” meaning “below,” and “limen,” meaning “threshold.” If something is subliminal, then, it is something that is “below the threshold”—here, below the threshold of conscious experience. Subliminal advertising, then, is advertising that operates below the limits of the consciousness of its audience. [Source: Encyclopedia of Business Ethics and Society; Advertising, Subliminal]
broader: marketing ethics

marketing ethics
type: Concept
narrower: subliminal advertising

concepts
type: Collection
type: ConceptGroup
member: subliminal advertising