social cognition
type: Concept
narrower: subliminal perception

concepts
type: Collection
type: ConceptGroup
member: subliminal perception

subliminal perception
type: Concept
definition: The term subliminal is derived from the terms sub (below) and limen (threshold), and it refers to perception so subtle it cannot reach conscious awareness. Most of the research on subliminal perception is done on visual subliminal perception. [Source: Encyclopedia of Social Psychology; Subliminal Perception]
broader: social cognition