scaling
type: Concept
narrower: summated rating scale

summated rating scale
type: Concept
definition: Definition One of the most frequently used methods for assessment of people's characteristics, especially attitudes, in the social sciences. Hundreds of summated rating scales have been developed for the measurement of attitudes, beliefs, emotions, feelings, perceptions and personality. [Source: The SAGE Dictionary of Social Research Methods; Summated Rating Scale]
broader: scaling

methods
type: Collection
type: ConceptGroup
member: summated rating scale