geographic information systems
type: Concept
narrower: supervised classification

concepts
type: Collection
type: ConceptGroup
member: supervised classification

supervised classification
type: Concept
definition: Supervised classification is the process of automatically grouping data into a set of classes by setting up prototypes using a priori knowledge obtained through training. It often involves selection of training data that can represent homogeneous examples of each class. [Source: Encyclopedia of Geography; Supervised Classification]
broader: geographic information systems