development economics
type: Concept
narrower: sustainable development alternatives

concepts
type: Collection
type: ConceptGroup
member: sustainable development alternatives

sustainable development alternatives
type: Concept
definition: The literature on sustainable development has long purported to focus on the tripartite relationship between economy, environment, and social justice. While all definitions of sustainability imply this trio of interrelated interests, only two are typically addressed in contemporary analysis: economic sustainability and environmental sustainability. [Source: Encyclopedia of Geography; Sustainable Development Alternatives]
broader: development economics