t distribution
type: Concept
definition: a distribution of t values which varies according to the number of cases in a sample. It becomes increasingly similar to a z or normal distribution the bigger the sample. [Source: The SAGE Dictionary of Statistics; t distribution]
broader: inferential statistics

inferential statistics
type: Concept
narrower: t distribution

methods
type: Collection
type: ConceptGroup
member: t distribution