tabloid newspapers
type: Concept
definition: Strictly speaking, the term tabloid refers to some newspapers' size, which is half that of a standard broadsheet. However, over the years it has taken on a broader definition that has less to do with size and more to do with the presentation and style of news. [Source: Encyclopedia of Journalism; Tabloid Newspapers]
broader: newspaper types

newspaper types
type: Concept
narrower: tabloid newspapers

concepts
type: Collection
type: ConceptGroup
member: tabloid newspapers