tabula rasa
type: Concept
definition: English philosopher John Locke proposed that the mind of the newborn infant is a tabula rasa, or blank slate, on which experience writes. Locke was an empiricist. [Source: Encyclopedia of Human Development; Tabula Rasa]
broader: theories and ideas about development

theories and ideas about development
type: Concept
narrower: tabula rasa

concepts
type: Collection
type: ConceptGroup
member: tabula rasa